{"text_format":"1","workbook":"xlsx","n_sheets":23,"sheets":["Getting Started","Exh. D","User Notes","Ref","Original Commitments","Protective Advances","Leverage (Current)","Portfolio Allocations","New Allocations","Hypo Pipeline","HFS","Active Portfolio","Paid Off","Tests (Chubb)","Tests (AF-US)","Tests (AF-JAP)","Tests (Kaiser)","Tests (Swiss)","Tests (Swiss NT)","Summary","Summary (AF-US)","Summary (AF-JAP)","Summary (CH)"],"not_rendered":{"charts":0,"images":4,"macros":1,"external_links":0,"defined_names":97,"comments":0,"pivot_tables":0},"unopened":[],"bounds":{"document_bytes":16777216,"sheet_cells":100000,"rows_first":2000,"rows_last":500,"rows_between":2000,"halvings":0,"cell_chars":16384,"cell_head_chars":4096},"cells_cut":0,"cells_raw":0,"read":"whole","date_system":"1900"}

{"sheet":"Getting Started","index":0,"n_rows":25,"n_cols":39,"rows_kept":25,"cut":false,"hidden":false,"merged":[[18,1,18,2],[20,1,20,2],[14,1,16,2]]}
[]
[]
[]
[]
[]
[]
[]
[]
{"$rows_left_out":18}
{"sheet":"Exh. D","index":1,"n_rows":0,"n_cols":0,"rows_kept":0,"cut":false,"hidden":false,"merged":[]}

{"sheet":"User Notes","index":2,"n_rows":3,"n_cols":1,"rows_kept":3,"cut":false,"hidden":true,"merged":[]}
["Ctrl+G only works on New Allocations."]
["Ctrl+G doesn't toggle empty cells.  Only cells with a zero value."]
["Sponsor can be free-form entry or selected from dropdown list."]

{"sheet":"Ref","index":3,"n_rows":73,"n_cols":20,"rows_kept":73,"cut":false,"hidden":false,"merged":[[12,0,12,3]]}
[null,null,null,null,null,null,null,"Raw Fund","Friendly Fund",null,null,null,"Sponsor",null,"Industry","ID",null,"Deal","Sponsor","Industry"]
[null,null,null,null,null,null,null,"NXT CAPITAL SLF IV FUNDING, LLC","SLF IV",null,null,null,"A&M CAPITAL PARTNERS",null,"Aerospace & Defense",1,null,"test1","a","Energy: Electricity"]
[null,null,null,"Table Color Coding",null,null,null,"NXT CAPITAL FUNDING I, LLC","NXT CAPITAL FUNDING I, LLC",null,"Add sponsors to those queried from EIM.",null,"AMERICAN CAPITAL, LTD.",null,"Automotive",2,null,"test2","d","Hotel, Gaming & Leisure"]
[null,null,null,"Blue are code-managed",null,null,null,"NXT","NXT CAPITAL, LLC",null,"*Discuss internally before modifying.",null,"AMERICAN CAPITAL, LTD.",null,"Banking/Finance/Insurance/RE",3]
[null,null,null,"Green are user-managed.",null,null,null,"NXT CAPITAL, LLC","NXT CAPITAL, LLC",null,"Additional Sponsors",null,"APAX PARTNERS",null,"Beverage, Food & Tobacco",4]
[null,null,null,null,null,null,null,"NXT CAPITAL CLO 2015-1, LLC","NXT CLO 2015-1",null,"Test Sponsor 1",null,"ARLINGTON CAPITAL PARTNERS",null,"Capital Equipment",5]
[null,null,null,null,null,null,null,"NXT CAPITAL CLO 2017-1, LLC","NXT CLO 2017-1",null,"Test Sponsor 2",null,"AUDAX PRIVATE EQUITY",null,"Chemicals, Plastics, & Rubber",6]
[null,null,null,null,null,null,null,"NXT CAPITAL CLO 2017-2, LLC","NXT CLO 2017-2",null,null,null,"AUDAX PRIVATE EQUITY",null,"Construction & Building",7]
{"$rows_left_out":66}
{"sheet":"Original Commitments","index":4,"n_rows":75,"n_cols":9,"rows_kept":75,"cut":false,"hidden":true,"merged":[]}
["SMA-SC",null,null,null,null,"SMA-SC NT"]
["Borrower Name","Tranche","Commitment Amount","Date Closed",null,"Borrower Name","Tranche","Commitment Amount","Date Closed"]
["ECM Industries","Revolver",452368.77,"2020-01-03",null,"Oliver Printing & Packaging","Delayed Draw",500000,"2020-01-09"]
["ECM Industries","Term Loan A",2547631.23,"2020-01-03",null,"OptConnect, LLC","Revolver",96153.85,"2020-01-16"]
["EFC International","Revolver",514138.82,"2020-02-07",null,"OptConnect, LLC","Term Loan A",903846.15,"2020-01-16"]
["EFC International","Term Loan A",3485861.18,"2020-02-07",null,"ICP Group","Term Loan C",240318.42,"2020-01-18"]
["Mr. Greens","Term Loan A",1000000,"2020-02-07",null,"Lazer Spot, Inc.","Revolver",156250,"2020-02-05"]
["Winzer Corporation","Term Loan B",1000000,"2020-02-28",null,"Lazer Spot, Inc.","Term Loan A",765625,"2020-02-05"]
{"$rows_left_out":68}
{"sheet":"Protective Advances","index":5,"n_rows":23,"n_cols":5,"rows_kept":23,"cut":false,"hidden":true,"merged":[]}
["SMA","Borrower Name","Tranche","Commitment Amount","Date Closed"]
["SMA-SC","TractManager","Incremental Term Loan",77272.87,"2020-03-23"]
["SMA-SC","Mr. Greens","Term Loan B",28777.07,"2020-03-31"]
["SMA-SC NT","TractManager","Incremental Term Loan",38590.050000000003,"2020-03-23"]
["SMA-SC NT","Mr. Greens","Term Loan B",14374.34,"2020-03-31"]
["SMA-CH","Mr. Greens","Term Loan B",46759.19,"2020-03-31"]
["SMA-CH","America's Auto Auction","Term Loan B",163005.51,"2020-05-20"]
["SMA-CC","Mr. Greens","Term Loan B",46759.19,"2020-03-31"]
{"$rows_left_out":16}
{"sheet":"Leverage (Current)","index":6,"n_rows":498,"n_cols":4,"rows_kept":498,"cut":false,"hidden":true,"merged":[]}
["Facility ID","Investor","Net Senior Leverage","Open Market Purchase"]
["0000017124","SMA-CH",4.1500000000000004]
["0000017106","SMA-CH",4.1500000000000004]
["0000016178","SMA-CH",3.8977427467000507]
["0000018801","SMA-CH",6.4803661768248615]
["0000018819","SMA-CH",6.4803661768248615]
["0000020308","SMA-CH",6.013199706673185]
["0000020287","SMA-CH",6.013199706673185]
{"$rows_left_out":491}
{"sheet":"Portfolio Allocations","index":7,"n_rows":157,"n_cols":32,"rows_kept":157,"cut":false,"hidden":true,"merged":[[81,1,81,11],[81,13,81,21],[81,23,81,31],[13,3,13,11],[28,17,28,19],[60,17,60,21],[51,1,51,15],[51,17,51,21],[45,3,45,21],[40,3,40,21],[41,3,41,21],[42,3,42,21],[43,3,43,21],[44,3,44,21],[47,3,47,21],[46,3,46,21],[6,3,6,11],[7,3,7,11],[8,3,8,11],[11,3,11,11],[12,3,12,11],[9,3,9,11],[10,3,10,11]]}
["Controls"]
[]
[]
[]
["Details"]
[]
[null,"Deal Name",null,"n/a"]
[null,"Description",null,"n/a"]
{"$rows_left_out":150}
{"sheet":"New Allocations","index":8,"n_rows":71,"n_cols":22,"rows_kept":71,"cut":false,"hidden":true,"merged":[[11,3,11,11],[37,3,37,21],[38,3,38,21],[39,3,39,21],[40,3,40,21],[25,13,25,15],[6,3,6,11],[7,3,7,11],[8,3,8,11],[9,3,9,11],[10,3,10,11],[57,17,57,21],[48,1,48,15],[48,17,48,21],[42,3,42,21],[41,3,41,21],[44,3,44,21],[43,3,43,21]]}
["Controls"]
[]
[]
[]
["Details"]
[]
[null,"Deal Name",null,"n/a"]
[null,"Description",null,"n/a"]
{"$rows_left_out":64}
{"sheet":"Hypo Pipeline","index":9,"n_rows":37,"n_cols":13,"rows_kept":37,"cut":false,"hidden":false,"merged":[]}
["Hypothetical Pipeline"]
[]
[]
["Exclude?","Fund","Deal Name","Description","Tranche","Target Date","Total Commitment","Principal Balance","Net Senior Leverage","Protective Advances","Sponsor","Moody's Industry","Open Market Purchase (Y)"]
[null,"SMA-CH","Supply One",null,"Term Loan","2021-03-10",2611277.25,2611277.25,3.65,"N","WELLSPRING CAPITAL MANAGEMENT","Containers, Packaging & Glass","N"]
[null,"SMA-CH","Tyto",null,"Revolver","2021-03-19",400000,0,3.8,"N","ARLINGTON CAPITAL PARTNERS","Aerospace & Defense","N"]
[null,"SMA-CH","Tyto",null,"Term Loan","2021-03-19",4600000,4600000,3.8,"N","ARLINGTON CAPITAL PARTNERS","Aerospace & Defense","N"]
[null,"SMA-CH","Foundation Partners Group",null,"Term Loan","2021-03-03",2250000,2181800,5,"N","Access","Services: Consumer","N"]
{"$rows_left_out":30}
{"sheet":"HFS","index":10,"n_rows":5,"n_cols":9,"rows_kept":5,"cut":false,"hidden":false,"merged":[]}
["Held for Sale"]
["Updated:","2020-03-02"]
[]
["Fund","Facility ID","Deal Name","Tranche","Total Commitment","Principal Balance","Net Senior Leverage","Sponsor","Moody's Industry"]
[null,null,null,null,null,null,{"$f":"IFERROR(MAX(\n--INDEX(tbl_NSL[#All],\nSUMPRODUCT( 1* (tbl_HFS[[#This Row],[Fund]] & TEXT( tbl_HFS[[#This Row],[Facility ID]],\"0000000000\") = tbl_NSL[Investor] & TEXT(tbl_NSL[Facility ID],\"0000000000\")), ROW(tbl_NSL[Investor]) ),\nMATCH(tbl_ExistingData[[#Headers],[Net Senior Leverage]], tbl_NSL[#Headers],0))\n),0)","v":0}]

{"sheet":"Active Portfolio","index":11,"n_rows":5,"n_cols":12,"rows_kept":5,"cut":false,"hidden":false,"merged":[[1,7,1,10]]}
["Active Portfolio"]
["Updated:","2020-02-28",null,null,null,null,null,"Blue fields are to be manually updated.  Changes are preserved locally in a background worksheet."]
[]
["Fund","Facility ID","Deal Name","Tranche","Closed Date","Total Commitment","Principal Balance","Net Senior Leverage","Sponsor","Moodys Industry","Open Market Purchase (Y)","Paid Off Date"]
[null,null,null,null,null,null,null,{"$f":"IFERROR(MAX(\n--INDEX(tbl_NSL[#All],\nSUMPRODUCT( 1* (tbl_ExistingData[[#This Row],[Fund]] & TEXT( tbl_ExistingData[[#This Row],[Facility ID]],\"0000000000\") = tbl_NSL[Investor] & TEXT(tbl_NSL[Facility ID],\"0000000000\")), ROW(tbl_NSL[Investor]) ),\nMATCH(tbl_ExistingData[[#Headers],[Net Senior Leverage]], tbl_NSL[#Headers],0))\n),0)","v":0},null,null,{"$f":"IFERROR(INDEX(tbl_NSL[], MATCH(tbl_ExistingData[[#This Row],[Fund]] & tbl_ExistingData[[#This Row],[Facility ID]], tbl_NSL[Investor] & tbl_NSL[Facility ID],0), MATCH(\"Open Market Purchase\", tbl_NSL[#Headers],0)),\"\")","v":""}]

{"sheet":"Paid Off","index":12,"n_rows":1,"n_cols":12,"rows_kept":1,"cut":false,"hidden":true,"merged":[]}
["Fund","Facility ID","Deal Name","Tranche","Closed Date","Total Commitment","Principal Balance","Net Senior Leverage","Sponsor","Moodys Industry","Open Market Purchase (Y/N)","Paid Off Date"]

{"sheet":"Tests (Chubb)","index":13,"n_rows":112,"n_cols":7,"rows_kept":112,"cut":false,"hidden":false,"merged":[]}
["Tests:","SMA-CH"]
[]
["SMA Commitment",{"$f":"VLOOKUP(Fund,tbl_Funds[[Fund]:[Principal Balance]],2,0)","v":400000000}]
[]
["Max Commitment"]
[]
["Bucket"]
["Commitment",{"$f":"Commitment","v":400000000}]
{"$rows_left_out":105}
{"sheet":"Tests (AF-US)","index":14,"n_rows":231,"n_cols":7,"rows_kept":231,"cut":false,"hidden":false,"merged":[]}
["Tests:","SMA-AF US"]
[]
["SMA Commitment",{"$f":"VLOOKUP(Fund,tbl_Funds[[Fund]:[Principal Balance]],2,0)","v":100000000}]
[]
["Max Commitment"]
[]
["Bucket"]
["Commitment",{"$f":"Commitment","v":100000000}]
{"$rows_left_out":224}
{"sheet":"Tests (AF-JAP)","index":15,"n_rows":231,"n_cols":7,"rows_kept":231,"cut":false,"hidden":false,"merged":[]}
["Tests:","SMA-AF JAP"]
[]
["SMA Commitment",{"$f":"VLOOKUP(Fund,tbl_Funds[[Fund]:[Principal Balance]],2,0)","v":900000000}]
[]
["Max Commitment"]
[]
["Bucket"]
["Commitment",{"$f":"Commitment","v":900000000}]
{"$rows_left_out":224}
{"sheet":"Tests (Kaiser)","index":16,"n_rows":95,"n_cols":7,"rows_kept":95,"cut":false,"hidden":false,"merged":[]}
["Tests:","SLF I"]
[]
["SMA Commitment",{"$f":"VLOOKUP(Fund,tbl_Funds[[Fund]:[Principal Balance]],2,0)","v":500000000}]
[]
["Max Commitment"]
[]
["Bucket"]
["Commitment",{"$f":"Commitment","v":500000000}]
{"$rows_left_out":88}
{"sheet":"Tests (Swiss)","index":17,"n_rows":27,"n_cols":2,"rows_kept":27,"cut":false,"hidden":false,"merged":[]}
["Tests:","SMA-SC"]
[]
["SMA Commitment",{"$f":"VLOOKUP(Fund,tbl_Funds[[Fund]:[Principal Balance]],2,0)","v":360000000}]
[]
["Max Commitment"]
["The sum of Existing Portfolio and Hypo Pipeline commitments must not exceed the Limit for the selected test type minus Protective Advances Holdback."]
["\"Available\" denotes capacity remaining following the stated calculation."]
[]
{"$rows_left_out":20}
{"sheet":"Tests (Swiss NT)","index":18,"n_rows":27,"n_cols":2,"rows_kept":27,"cut":false,"hidden":false,"merged":[]}
["Tests:","SMA-SC NT"]
[]
["SMA Commitment",{"$f":"VLOOKUP(Fund,tbl_Funds[[Fund]:[Principal Balance]],2,0)","v":113500000}]
[]
["Max Commitment"]
["The sum of Existing Portfolio and Hypo Pipeline commitments must not exceed the Limit for the selected test type minus Protective Advances Holdback."]
["\"Available\" denotes capacity remaining following the stated calculation."]
[]
{"$rows_left_out":20}
{"sheet":"Summary","index":19,"n_rows":34,"n_cols":21,"rows_kept":34,"cut":false,"hidden":false,"merged":[]}
["Summary:","SMA-CH",null,null,null,null,null,null,null,null,null,"Summary:","SLF I"]
["Constraint","Description","Bucket Size","Portfolio","Pipeline","Total","Availability","Pass/Fail","% of SMA Commitment","% of Hypo and Existing Commitment",null,"Constraint","Description","Bucket Size","Portfolio","Pipeline","Total","Availability","Pass/Fail","% of SMA Commitment","% of Hypo and Existing Commitment"]
["Max Commitment","Total allocations cannot exceed max commitment to fund.",{"$f":"'Tests (Chubb)'!B8","v":400000000},{"$f":"'Tests (Chubb)'!B13","v":0},{"$f":"'Tests (Chubb)'!B14","v":55611277.25},{"$f":"D3+E3","v":55611277.25},{"$f":"C3-F3","v":344388722.75},{"$f":"_xlfn.SWITCH(TRUE,G3>0,\"Pass\",G3<0,\"Fail\")","v":"Pass"},{"$f":"SummaryChubb[[#This Row],[Total]]/VLOOKUP(FundCB,tbl_Funds[],2,0)","v":0.139028193125},{"$f":"SummaryChubb[[#This Row],[Total]]/(SUMIF(tbl_ExistingData[Fund],FundCB,tbl_ExistingData[Total Commitment]) + SUMIF(tbl_HypoPipeline[Fund],FundCB,tbl_HypoPipeline[Total Commitment]))","v":1},null,"Max Commitment","Total allocations cannot exceed max commitment to fund.",{"$f":"'Tests (Kaiser)'!B8","v":500000000},{"$f":"'Tests (Kaiser)'!B13","v":0},{"$f":"'Tests (Kaiser)'!B14","v":0},{"$f":"O3+P3","v":0},{"$f":"N3-Q3","v":500000000},{"$f":"_xlfn.SWITCH(TRUE,R3>0,\"Pass\",R3<=0,\"Fail\")","v":"Pass"},{"$f":"SummaryKaiser[[#This Row],[Total]]/VLOOKUP(FundCB,tbl_Funds[],2,0)","v":0},{"$f":"SummaryKaiser[[#This Row],[Total]]/(SUMIF(tbl_ExistingData[Fund],FundCB,tbl_ExistingData[Total Commitment]) + SUMIF(tbl_HypoPipeline[Fund],FundCB,tbl_HypoPipeline[Total Commitment]))","v":0}]
["Unfunded Commitment","(i) The aggregate outstanding commitments in revolving credit facilities and the unfunded portion of delayed draw term loans (it being agreed that a delayed draw term loan, or portion thereof, once funded, shall no longer be deemed unfunded to the extent of the amount so funded) shall not exceed 20% of the SMA Commitment Amount.",{"$f":"'Tests (Chubb)'!B25","v":80000000},{"$f":"'Tests (Chubb)'!B32","v":0},{"$f":"'Tests (Chubb)'!B38","v":1551250},{"$f":"D4+E4","v":1551250},{"$f":"C4-F4","v":78448750},"Pass",{"$f":"SummaryChubb[[#This Row],[Total]]/VLOOKUP(FundCB,tbl_Funds[],2,0)","v":3.8781250000000001E-3},{"$f":"SummaryChubb[[#This Row],[Total]]/(SUMIF(tbl_ExistingData[Fund],FundCB,tbl_ExistingData[Total Commitment]) + SUMIF(tbl_HypoPipeline[Fund],FundCB,tbl_HypoPipeline[Total Commitment]))","v":2.7894522059372408E-2},null,"Unfunded Commitment",{"$f":"'Tests (Kaiser)'!A23","v":"The sum of Portfolio and Pipeline values (Revolver Commitments + DDTL Commitments - DDTL Principal) must be < 14% of total SMA Commitment."},{"$f":"'Tests (Kaiser)'!B25","v":70000000},{"$f":"'Tests (Kaiser)'!B32","v":0},{"$f":"'Tests (Kaiser)'!B38","v":0},{"$f":"O4+P4","v":0},{"$f":"N4-Q4","v":70000000},{"$f":"_xlfn.SWITCH(TRUE,R4>0,\"Pass\",R4<=0,\"Fail\")","v":"Pass"},{"$f":"SummaryKaiser[[#This Row],[Total]]/VLOOKUP(FundCB,tbl_Funds[],2,0)","v":0},{"$f":"SummaryKaiser[[#This Row],[Total]]/(SUMIF(tbl_ExistingData[Fund],FundCB,tbl_ExistingData[Total Commitment]) + SUMIF(tbl_HypoPipeline[Fund],FundCB,tbl_HypoPipeline[Total Commitment]))","v":0}]
["4.5x Leverage","(v) Not more than 30% of the SMA Commitment Amount may consist of Commitment Amounts with respect to Eligible Assets made to borrowers having a Net Senior Leverage Ratio (as defined below) of greater than 4.5x on the purchase date of the relevant Eligible Asset.  For purposes hereof, the “Net Senior Leverage Ratio” of a borrower shall have the meaning of “Net Senior Leverage Ratio” (or comparable definition) as set forth in the underlying instruments for the relevant Eligible Asset, or in the case of any Eligible Asset with respect to which the underlying instruments do not include a definition of “Net Senior Leverage Ratio” or comparable definition, shall mean the ratio of (a) the “total indebtedness” (as defined in the underlying instruments for such Eligible Asset or comparable definition thereof, including, without limitation, such Eligible Asset) of the applicable borrower as of the date of determination, minus any junior indebtedness (including, without limitation, any unsecured indebtedness) of such borrower as of such date, minus the unrestricted cash of such borrower as of such date to (b) trailing twelve-month adjusted EBITDA of such borrower, as calculated by the Manager in good faith.",{"$f":"'Tests (Chubb)'!B45","v":120000000},{"$f":"'Tests (Chubb)'!B48","v":0},{"$f":"'Tests (Chubb)'!B49","v":27000000},{"$f":"D5+E5","v":27000000},{"$f":"C5-F5","v":93000000},"Pass",{"$f":"SummaryChubb[[#This Row],[Total]]/VLOOKUP(FundCB,tbl_Funds[],2,0)","v":6.7500000000000004E-2},{"$f":"SummaryChubb[[#This Row],[Total]]/(SUMIF(tbl_ExistingData[Fund],FundCB,tbl_ExistingData[Total Commitment]) + SUMIF(tbl_HypoPipeline[Fund],FundCB,tbl_HypoPipeline[Total Commitment]))","v":0.48551303503823051},null,"Secondary Purchases",{"$f":"'Tests (Kaiser)'!A47","v":"The aggregate principal amount of Purchased Participations in Loans acquired by Seller in secondary market transactions shall not exceed 20% of the aggregate principal amount of all Purchased Participations."},{"$f":"'Tests (Kaiser)'!B49","v":100000000},{"$f":"'Tests (Kaiser)'!B50","v":0},{"$f":"'Tests (Kaiser)'!B50","v":0},{"$f":"O5+P5","v":0},{"$f":"N5-Q5","v":100000000},{"$f":"_xlfn.SWITCH(TRUE,R5>0,\"Pass\",R5<=0,\"Fail\")","v":"Pass"},{"$f":"SummaryKaiser[[#This Row],[Total]]/VLOOKUP(FundCB,tbl_Funds[],2,0)","v":0},{"$f":"SummaryKaiser[[#This Row],[Total]]/(SUMIF(tbl_ExistingData[Fund],FundCB,tbl_ExistingData[Total Commitment]) + SUMIF(tbl_HypoPipeline[Fund],FundCB,tbl_HypoPipeline[Total Commitment]))","v":0}]
["1st Largest Industry","(viii) The largest aggregate exposure to any one industry, based on Moody’s Industry Code classifications, as determined by the Manager, may not exceed 25% of the SMA Commitment Amount.",{"$f":"'Tests (Chubb)'!B65","v":100000000},{"$f":"'Tests (Chubb)'!B69","v":0},{"$f":"'Tests (Chubb)'!B70","v":5000000},5000000,95000000,"Pass",{"$f":"SummaryChubb[[#This Row],[Total]]/VLOOKUP(FundCB,tbl_Funds[],2,0)","v":1.2500000000000001E-2},{"$f":"SummaryChubb[[#This Row],[Total]]/(SUMIF(tbl_ExistingData[Fund],FundCB,tbl_ExistingData[Total Commitment]) + SUMIF(tbl_HypoPipeline[Fund],FundCB,tbl_HypoPipeline[Total Commitment]))","v":8.990982130337602E-2},null,"Largest Industry",{"$f":"'Tests (Kaiser)'!A61","v":"Maximum aggregate exposure of 20% of SMA Commitment for any industry."},{"$f":"'Tests (Kaiser)'!B63","v":100000000},{"$f":"'Tests (Kaiser)'!B67","v":0},{"$f":"'Tests (Kaiser)'!B68","v":0},0,100000000,"Pass",{"$f":"SummaryKaiser[[#This Row],[Total]]/VLOOKUP(FundCB,tbl_Funds[],2,0)","v":0},{"$f":"SummaryKaiser[[#This Row],[Total]]/(SUMIF(tbl_ExistingData[Fund],FundCB,tbl_ExistingData[Total Commitment]) + SUMIF(tbl_HypoPipeline[Fund],FundCB,tbl_HypoPipeline[Total Commitment]))","v":0}]
["2nd Largest Industry","(viii) The second largest aggregate exposure to any one industry, based on Moody’s Industry Code classifications, as determined by the Manager, may not exceed 20%, of the SMA Commitment Amount.",{"$f":"'Tests (Chubb)'!B74","v":80000000},{"$f":"'Tests (Chubb)'!B78","v":0},{"$f":"'Tests (Chubb)'!B79","v":5000000},5000000,75000000,"Pass",{"$f":"SummaryChubb[[#This Row],[Total]]/VLOOKUP(FundCB,tbl_Funds[],2,0)","v":1.2500000000000001E-2},{"$f":"SummaryChubb[[#This Row],[Total]]/(SUMIF(tbl_ExistingData[Fund],FundCB,tbl_ExistingData[Total Commitment]) + SUMIF(tbl_HypoPipeline[Fund],FundCB,tbl_HypoPipeline[Total Commitment]))","v":8.990982130337602E-2}]
["Any Other Industry","(ix) Aggregate exposure to any other single industry (other than the industries referenced in clause (vii) above), based on Moody’s Industry Code classifications, as determined by the Manager, may not exceed 15% of the SMA Commitment Amount.",{"$f":"'Tests (Chubb)'!B83","v":60000000},{"$f":"'Tests (Chubb)'!B87","v":0},{"$f":"'Tests (Chubb)'!B88","v":3000000},3000000,57000000,"Pass",{"$f":"SummaryChubb[[#This Row],[Total]]/VLOOKUP(FundCB,tbl_Funds[],2,0)","v":7.4999999999999997E-3},{"$f":"SummaryChubb[[#This Row],[Total]]/(SUMIF(tbl_ExistingData[Fund],FundCB,tbl_ExistingData[Total Commitment]) + SUMIF(tbl_HypoPipeline[Fund],FundCB,tbl_HypoPipeline[Total Commitment]))","v":5.3945892782025613E-2}]
{"$rows_left_out":27}
{"sheet":"Summary (AF-US)","index":20,"n_rows":21,"n_cols":17,"rows_kept":21,"cut":false,"hidden":false,"merged":[]}
["Eligibility Summary, Aflac US"]
[null,null,null,null,null,null,null,null,"SMA Commitment",null,{"$f":"VLOOKUP(Summary!FundAFUS,tbl_Funds[],2,0)","v":100000000}]
[null,null,null,null,null,null,null,null,"Hypo and Existing Commitment",null,{"$f":"SUMIF(tbl_ExistingData[Fund],Summary!FundAFUS,tbl_ExistingData[Total Commitment]) + SUMIF(tbl_HypoPipeline[Fund],Summary!FundAFUS,tbl_HypoPipeline[Total Commitment])","v":0}]
[]
["Eligibility Requirement",null,"Bucket Size",null,"Existing Portfolio",null,"Hypo Amounts",null,"Availability",null,"Total",null,"Pass/Fail",null,"% of SMA Commitment",null,"% of Hypo and Existing Commitment"]
[]
["(i) The aggregate outstanding commitments in revolving credit facilities and the unfunded portion of delayed draw term loans (it being agreed that a delayed draw term loan, or portion thereof, once funded, shall no longer be deemed unfunded to the extent of the amount so funded) shall not exceed 15% of the SMA Commitment Amount.",null,{"$f":"'Tests (AF-US)'!$B$25","v":15000000},null,{"$f":"'Tests (AF-US)'!$B$32","v":0},null,{"$f":"'Tests (AF-US)'!$B$38","v":0},null,{"$f":"C7-K7","v":15000000},null,{"$f":"SUM(E7,G7)","v":0},null,{"$f":"_xlfn.SWITCH(TRUE,I7>0,\"Pass\",I7<=0,\"Fail\")","v":"Pass"},null,{"$f":"IFERROR(K7/$K$2,0)","v":0},null,{"$f":"IFERROR(K7/$K$3,0)","v":0}]
[]
{"$rows_left_out":14}
{"sheet":"Summary (AF-JAP)","index":21,"n_rows":21,"n_cols":17,"rows_kept":21,"cut":false,"hidden":false,"merged":[]}
["Eligibility Summary, Aflac Japan"]
[null,null,null,null,null,null,null,null,"SMA Commitment",null,{"$f":"VLOOKUP(Summary!FundAFJAP,tbl_Funds[],2,0)","v":900000000}]
[null,null,null,null,null,null,null,null,"Hypo and Existing Commitment",null,{"$f":"SUMIF(tbl_ExistingData[Fund],Summary!FundAFJAP,tbl_ExistingData[Total Commitment]) + SUMIF(tbl_HypoPipeline[Fund],Summary!FundAFJAP,tbl_HypoPipeline[Total Commitment])","v":0}]
[]
["Eligibility Requirement",null,"Bucket Size",null,"Existing Portfolio",null,"Hypo Amounts",null,"Availability",null,"Total",null,"Pass/Fail",null,"% of SMA Commitment",null,"% of Hypo and Existing Commitment"]
[]
["(i) The aggregate outstanding commitments in revolving credit facilities and the unfunded portion of delayed draw term loans (it being agreed that a delayed draw term loan, or portion thereof, once funded, shall no longer be deemed unfunded to the extent of the amount so funded) shall not exceed 15% of the SMA Commitment Amount.",null,{"$f":"'Tests (AF-JAP)'!$B$25","v":135000000},null,{"$f":"'Tests (AF-JAP)'!$B$32","v":0},null,{"$f":"'Tests (AF-JAP)'!$B$38","v":0},null,{"$f":"C7-K7","v":135000000},null,{"$f":"SUM(E7,G7)","v":0},null,{"$f":"_xlfn.SWITCH(TRUE,I7>0,\"Pass\",I7<=0,\"Fail\")","v":"Pass"},null,{"$f":"IFERROR(K7/$K$2,0)","v":0},null,{"$f":"IFERROR(K7/$K$3,0)","v":0}]
[]
{"$rows_left_out":14}
{"sheet":"Summary (CH)","index":22,"n_rows":20,"n_cols":17,"rows_kept":20,"cut":false,"hidden":false,"merged":[]}
["Eligibility Summary, Chubb"]
[null,null,null,null,null,null,null,null,"SMA Commitment",null,{"$f":"VLOOKUP(Summary!FundCB,tbl_Funds[],2,0)","v":400000000},null,null,null,"Hypo and Existing Commitment",null,{"$f":"SUMIF(tbl_ExistingData[Fund],Summary!FundCB,tbl_ExistingData[Total Commitment]) + SUMIF(tbl_HypoPipeline[Fund],Summary!FundCB,tbl_HypoPipeline[Total Commitment])","v":55611277.25}]
[null,null,null,null,null,null,null,null,"Available to Allocate",null,{"$f":"K2-SUM(Q2:Q4)","v":343601042.51999998},null,null,null,"Protective Advance in Hypo",null,{"$f":"SUMIFS(tbl_HypoPipeline[Total Commitment],tbl_HypoPipeline[Fund],Summary!FundCB,tbl_HypoPipeline[Protective Advances],\"Y\")","v":0}]
[null,null,null,null,null,null,null,null,null,null,null,null,null,null,"Protective Advance in Portfolio",null,{"$f":"SUMIFS(tbl_ProtectiveAdvances[Commitment Amount],tbl_ProtectiveAdvances[SMA],Summary!FundCB)","v":787680.23}]
[]
["Eligibility Requirement",null,"Bucket Size",null,"Existing Portfolio",null,"Hypo Amounts",null,"Availability",null,"Total",null,"Pass/Fail",null,"% of SMA Commitment",null,"% of Hypo and Existing Commitment"]
[]
["(i) The aggregate outstanding commitments in revolving credit facilities and the unfunded portion of delayed draw term loans (it being agreed that a delayed draw term loan, or portion thereof, once funded, shall no longer be deemed unfunded to the extent of the amount so funded) shall not exceed 20% of the SMA Commitment Amount.",null,{"$f":"'Tests (Chubb)'!$B$25","v":80000000},null,{"$f":"'Tests (Chubb)'!$B$32","v":0},null,{"$f":"'Tests (Chubb)'!$B$38","v":1551250},null,{"$f":"C8-K8","v":78448750},null,{"$f":"SUM(E8,G8)","v":1551250},null,{"$f":"_xlfn.SWITCH(TRUE,I8>0,\"Pass\",I8<=0,\"Fail\")","v":"Pass"},null,{"$f":"IFERROR(K8/$K$2,0)","v":3.8781250000000001E-3},null,{"$f":"IFERROR(K8/$Q$2,0)","v":2.7894522059372408E-2}]
{"$rows_left_out":12}